Compile filezilla 3.9.0.6 under Mac osx

Moderator: Project members

Message
Author
cs19
504 Command not implemented
Posts: 10
Joined: 2014-11-11 05:59

Compile filezilla 3.9.0.6 under Mac osx

#1 Post by cs19 » 2014-11-11 06:07

Hi, I have been trying to compile the newest version of filezilla on Mac but I kept getting this error about wxWidgets. The error is:
checking for wxWidgets version >= 3.0.1 (--unicode=yes --universal=no)... yes (version 3.0.1)
checking for wxWidgets static library... no
checking positional printf argument support in wxWidgets... no
configure: error: in `/Users/lexy0922/Filezilla_project/filezilla-3.9.0':
configure: error: Positional printf argument support in wxWidgets is required by FileZilla. Please rebuild wxWidgets and pass --enable-printfposparam to its configure script.
See `config.log' for more details

I made sure that I built wxWidgets with "--enable-printfposparam" but it still does not work. Can someone help me with this??

User avatar
botg
Site Admin
Posts: 33176
Joined: 2004-02-23 20:49
First name: Tim
Last name: Kosse
Contact:

Re: Compile filezilla 3.9.0.6 under Mac osx

#2 Post by botg » 2014-11-11 08:36

Please attach config.log for more details.

cs19
504 Command not implemented
Posts: 10
Joined: 2014-11-11 05:59

Re: Compile filezilla 3.9.0.6 under Mac osx

#3 Post by cs19 » 2014-11-11 14:49

Thank you for the timely response. Here is the config.log:
This file contains any messages produced by compilers while
running configure, to aid debugging if configure makes a mistake.

It was created by FileZilla configure 3.9.0.6, which was
generated by GNU Autoconf 2.69. Invocation command line was

$ ./configure --with-tinyxml=builtin

## --------- ##
## Platform. ##
## --------- ##

hostname = sumomomatoMacBook-Pro.local
uname -m = x86_64
uname -r = 13.4.0
uname -s = Darwin
uname -v = Darwin Kernel Version 13.4.0: Sun Aug 17 19:50:11 PDT 2014; root:xnu-2422.115.4~1/RELEASE_X86_64

/usr/bin/uname -p = i386
/bin/uname -X = unknown

/bin/arch = unknown
/usr/bin/arch -k = unknown
/usr/convex/getsysinfo = unknown
/usr/bin/hostinfo = Mach kernel version:
Darwin Kernel Version 13.4.0: Sun Aug 17 19:50:11 PDT 2014; root:xnu-2422.115.4~1/RELEASE_X86_64
Kernel configured for up to 4 processors.
2 processors are physically available.
4 processors are logically available.
Processor type: i486 (Intel 80486)
Processors active: 0 1 2 3
Primary memory available: 4.00 gigabytes
Default processor set: 167 tasks, 804 threads, 4 processors
Load average: 2.12, Mach factor: 2.32
/bin/machine = unknown
/usr/bin/oslevel = unknown
/bin/universe = unknown

PATH: /Users/lexy0922/filezilla/gettext/bin
PATH: /Users/lexy0922/filezilla/pkg-config/bin
PATH: /Users/lexy0922/filezilla/wxMac/bin
PATH: /Users/lexy0922/filezilla/gettext/bin
PATH: /Users/lexy0922/filezilla/pkg-config/bin
PATH: /Users/lexy0922/filezilla/wxMac/bin
PATH: /opt/local/bin
PATH: /opt/local/sbin
PATH: /Library/Frameworks/Python.framework/Versions/2.7/bin
PATH: /Library/Frameworks/Python.framework/Versions/Current/bin
PATH: /usr/bin
PATH: /bin
PATH: /usr/sbin
PATH: /sbin
PATH: /usr/local/bin
PATH: /opt/X11/bin


## ----------- ##
## Core tests. ##
## ----------- ##

configure:2665: checking for a BSD-compatible install
configure:2733: result: /usr/bin/install -c
configure:2744: checking whether build environment is sane
configure:2799: result: yes
configure:2950: checking for a thread-safe mkdir -p
configure:2989: result: config/install-sh -c -d
configure:2996: checking for gawk
configure:3026: result: no
configure:2996: checking for mawk
configure:3026: result: no
configure:2996: checking for nawk
configure:3026: result: no
configure:2996: checking for awk
configure:3012: found /usr/bin/awk
configure:3023: result: awk
configure:3034: checking whether make sets $(MAKE)
configure:3056: result: yes
configure:3085: checking whether make supports nested variables
configure:3102: result: yes
configure:3233: checking build system type
configure:3247: result: x86_64-apple-darwin13.4.0
configure:3267: checking host system type
configure:3280: result: x86_64-apple-darwin13.4.0
configure:3359: checking for g++
configure:3375: found /usr/bin/g++
configure:3386: result: g++
configure:3413: checking for C++ compiler version
configure:3422: g++ --version >&5
Apple LLVM version 5.1 (clang-503.0.40) (based on LLVM 3.4svn)
Target: x86_64-apple-darwin13.4.0
Thread model: posix
Configured with: --prefix=/Applications/Xcode.app/Contents/Developer/usr --with-gxx-include-dir=/Applications/Xcode.app/Contents/Developer/Platforms/MacOSX.platform/Developer/SDKs/MacOSX10.9.sdk/usr/include/c++/4.2.1
configure:3433: $? = 0
configure:3422: g++ -v >&5
Configured with: --prefix=/Applications/Xcode.app/Contents/Developer/usr --with-gxx-include-dir=/Applications/Xcode.app/Contents/Developer/Platforms/MacOSX.platform/Developer/SDKs/MacOSX10.9.sdk/usr/include/c++/4.2.1
Apple LLVM version 5.1 (clang-503.0.40) (based on LLVM 3.4svn)
Target: x86_64-apple-darwin13.4.0
Thread model: posix
configure:3433: $? = 0
configure:3422: g++ -V >&5
clang: error: argument to '-V' is missing (expected 1 value)
clang: error: no input files
configure:3433: $? = 1
configure:3422: g++ -qversion >&5
clang: error: unknown argument: '-qversion' [-Wunused-command-line-argument-hard-error-in-future]
clang: note: this will be a hard error (cannot be downgraded to a warning) in the future
clang: error: no input files
configure:3433: $? = 1
configure:3453: checking whether the C++ compiler works
configure:3475: g++ -O2 -arch i386 -O2 -arch i386 -O2 -arch i386 -O2 -arch i386 -O2 -arch i386 -O2 -arch i386 -O2 -arch i386 -O2 -arch i386 -O2 -arch i386 -O2 -arch i386 -I/Users/lexy0922/filezilla/libidn/include -I/Users/lexy0922/filezilla/libidn/include -arch i386 -L/Users/lexy0922/filezilla/libidn/lib -arch i386 -arch i386 -L/Users/lexy0922/filezilla/libidn/lib -arch i386 conftest.cpp >&5
configure:3479: $? = 0
configure:3527: result: yes
configure:3530: checking for C++ compiler default output file name
configure:3532: result: a.out
configure:3538: checking for suffix of executables
configure:3545: g++ -o conftest -O2 -arch i386 -O2 -arch i386 -O2 -arch i386 -O2 -arch i386 -O2 -arch i386 -O2 -arch i386 -O2 -arch i386 -O2 -arch i386 -O2 -arch i386 -O2 -arch i386 -I/Users/lexy0922/filezilla/libidn/include -I/Users/lexy0922/filezilla/libidn/include -arch i386 -L/Users/lexy0922/filezilla/libidn/lib -arch i386 -arch i386 -L/Users/lexy0922/filezilla/libidn/lib -arch i386 conftest.cpp >&5
configure:3549: $? = 0
configure:3571: result:
configure:3593: checking whether we are cross compiling
configure:3601: g++ -o conftest -O2 -arch i386 -O2 -arch i386 -O2 -arch i386 -O2 -arch i386 -O2 -arch i386 -O2 -arch i386 -O2 -arch i386 -O2 -arch i386 -O2 -arch i386 -O2 -arch i386 -I/Users/lexy0922/filezilla/libidn/include -I/Users/lexy0922/filezilla/libidn/include -arch i386 -L/Users/lexy0922/filezilla/libidn/lib -arch i386 -arch i386 -L/Users/lexy0922/filezilla/libidn/lib -arch i386 conftest.cpp >&5
configure:3605: $? = 0
configure:3612: ./conftest
configure:3616: $? = 0
configure:3631: result: no
configure:3636: checking for suffix of object files
configure:3658: g++ -c -O2 -arch i386 -O2 -arch i386 -O2 -arch i386 -O2 -arch i386 -O2 -arch i386 -O2 -arch i386 -O2 -arch i386 -O2 -arch i386 -O2 -arch i386 -O2 -arch i386 -I/Users/lexy0922/filezilla/libidn/include -I/Users/lexy0922/filezilla/libidn/include conftest.cpp >&5
configure:3662: $? = 0
configure:3683: result: o
configure:3687: checking whether we are using the GNU C++ compiler
configure:3706: g++ -c -O2 -arch i386 -O2 -arch i386 -O2 -arch i386 -O2 -arch i386 -O2 -arch i386 -O2 -arch i386 -O2 -arch i386 -O2 -arch i386 -O2 -arch i386 -O2 -arch i386 -I/Users/lexy0922/filezilla/libidn/include -I/Users/lexy0922/filezilla/libidn/include conftest.cpp >&5
configure:3706: $? = 0
configure:3715: result: yes
configure:3724: checking whether g++ accepts -g
configure:3744: g++ -c -g -I/Users/lexy0922/filezilla/libidn/include -I/Users/lexy0922/filezilla/libidn/include conftest.cpp >&5
configure:3744: $? = 0
configure:3785: result: yes
configure:3819: checking for style of include used by make
configure:3847: result: GNU
configure:3873: checking dependency style of g++
configure:3984: result: gcc3
configure:4047: checking for gcc
configure:4063: found /usr/bin/gcc
configure:4074: result: gcc
configure:4303: checking for C compiler version
configure:4312: gcc --version >&5
Apple LLVM version 5.1 (clang-503.0.40) (based on LLVM 3.4svn)
Target: x86_64-apple-darwin13.4.0
Thread model: posix
Configured with: --prefix=/Applications/Xcode.app/Contents/Developer/usr --with-gxx-include-dir=/Applications/Xcode.app/Contents/Developer/Platforms/MacOSX.platform/Developer/SDKs/MacOSX10.9.sdk/usr/include/c++/4.2.1
configure:4323: $? = 0
configure:4312: gcc -v >&5
Configured with: --prefix=/Applications/Xcode.app/Contents/Developer/usr --with-gxx-include-dir=/Applications/Xcode.app/Contents/Developer/Platforms/MacOSX.platform/Developer/SDKs/MacOSX10.9.sdk/usr/include/c++/4.2.1
Apple LLVM version 5.1 (clang-503.0.40) (based on LLVM 3.4svn)
Target: x86_64-apple-darwin13.4.0
Thread model: posix
configure:4323: $? = 0
configure:4312: gcc -V >&5
clang: error: argument to '-V' is missing (expected 1 value)
clang: error: no input files
configure:4323: $? = 1
configure:4312: gcc -qversion >&5
clang: error: unknown argument: '-qversion' [-Wunused-command-line-argument-hard-error-in-future]
clang: note: this will be a hard error (cannot be downgraded to a warning) in the future
clang: error: no input files
configure:4323: $? = 1
configure:4327: checking whether we are using the GNU C compiler
configure:4346: gcc -c -O2 -arch i386 -O2 -arch i386 -O2 -arch i386 -O2 -arch i386 -I/Users/lexy0922/filezilla/libidn/include -I/Users/lexy0922/filezilla/libidn/include conftest.c >&5
configure:4346: $? = 0
configure:4355: result: yes
configure:4364: checking whether gcc accepts -g
configure:4384: gcc -c -g -I/Users/lexy0922/filezilla/libidn/include -I/Users/lexy0922/filezilla/libidn/include conftest.c >&5
configure:4384: $? = 0
configure:4425: result: yes
configure:4442: checking for gcc option to accept ISO C89
configure:4505: gcc -c -O2 -arch i386 -O2 -arch i386 -O2 -arch i386 -O2 -arch i386 -I/Users/lexy0922/filezilla/libidn/include -I/Users/lexy0922/filezilla/libidn/include conftest.c >&5
configure:4505: $? = 0
configure:4518: result: none needed
configure:4543: checking whether gcc understands -c and -o together
configure:4565: gcc -c conftest.c -o conftest2.o
configure:4568: $? = 0
configure:4565: gcc -c conftest.c -o conftest2.o
configure:4568: $? = 0
configure:4580: result: yes
configure:4599: checking dependency style of gcc
configure:4710: result: gcc3
configure:4774: checking how to print strings
configure:4801: result: printf
configure:4822: checking for a sed that does not truncate output
configure:4886: result: /usr/bin/sed
configure:4904: checking for grep that handles long lines and -e
configure:4962: result: /usr/bin/grep
configure:4967: checking for egrep
configure:5029: result: /usr/bin/grep -E
configure:5034: checking for fgrep
configure:5096: result: /usr/bin/grep -F
configure:5131: checking for ld used by gcc
configure:5198: result: /Applications/Xcode.app/Contents/Developer/Toolchains/XcodeDefault.xctoolchain/usr/bin/ld
configure:5205: checking if the linker (/Applications/Xcode.app/Contents/Developer/Toolchains/XcodeDefault.xctoolchain/usr/bin/ld) is GNU ld
configure:5220: result: no
configure:5232: checking for BSD- or MS-compatible name lister (nm)
configure:5281: result: /opt/local/bin/nm
configure:5411: checking the name lister (/opt/local/bin/nm) interface
configure:5418: gcc -c -O2 -arch i386 -O2 -arch i386 -O2 -arch i386 -O2 -arch i386 -I/Users/lexy0922/filezilla/libidn/include -I/Users/lexy0922/filezilla/libidn/include conftest.c >&5
configure:5421: /opt/local/bin/nm "conftest.o"
configure:5424: output
00000000 S _some_variable
configure:5431: result: BSD nm
configure:5434: checking whether ln -s works
configure:5438: result: yes
configure:5446: checking the maximum length of command line arguments
configure:5577: result: 196608
configure:5594: checking whether the shell understands some XSI constructs
configure:5604: result: yes
configure:5608: checking whether the shell understands "+="
configure:5614: result: yes
configure:5649: checking how to convert x86_64-apple-darwin13.4.0 file names to x86_64-apple-darwin13.4.0 format
configure:5689: result: func_convert_file_noop
configure:5696: checking how to convert x86_64-apple-darwin13.4.0 file names to toolchain format
configure:5716: result: func_convert_file_noop
configure:5723: checking for /Applications/Xcode.app/Contents/Developer/Toolchains/XcodeDefault.xctoolchain/usr/bin/ld option to reload object files
configure:5730: result: -r
configure:5804: checking for objdump
configure:5834: result: no
configure:5863: checking how to recognize dependent libraries
configure:6061: result: pass_all
configure:6146: checking for dlltool
configure:6176: result: no
configure:6206: checking how to associate runtime and link libraries
configure:6233: result: printf %s\n
configure:6294: checking for ar
configure:6310: found /opt/local/bin/ar
configure:6321: result: ar
configure:6358: checking for archiver @FILE support
configure:6375: gcc -c -O2 -arch i386 -O2 -arch i386 -O2 -arch i386 -O2 -arch i386 -I/Users/lexy0922/filezilla/libidn/include -I/Users/lexy0922/filezilla/libidn/include conftest.c >&5
configure:6375: $? = 0
configure:6378: ar cru libconftest.a @conftest.lst >&5
ar: @conftest.lst: No such file or directory
configure:6381: $? = 1
configure:6401: result: no
configure:6459: checking for strip
configure:6475: found /opt/local/bin/strip
configure:6486: result: strip
configure:6558: checking for ranlib
configure:6574: found /opt/local/bin/ranlib
configure:6585: result: ranlib
configure:6687: checking command to parse /opt/local/bin/nm output from gcc object
configure:6807: gcc -c -O2 -arch i386 -O2 -arch i386 -O2 -arch i386 -O2 -arch i386 -I/Users/lexy0922/filezilla/libidn/include -I/Users/lexy0922/filezilla/libidn/include conftest.c >&5
configure:6810: $? = 0
configure:6814: /opt/local/bin/nm conftest.o \| sed -n -e 's/^.*[ ]\([BCDEGRST][BCDEGRST]*\)[ ][ ]*\([_A-Za-z][_A-Za-z0-9]*\)$/\1 \2 \2/p' | sed '/ __gnu_lto/d' \> conftest.nm
configure:6817: $? = 0
cannot find nm_test_var in conftest.nm
configure:6807: gcc -c -O2 -arch i386 -O2 -arch i386 -O2 -arch i386 -O2 -arch i386 -I/Users/lexy0922/filezilla/libidn/include -I/Users/lexy0922/filezilla/libidn/include conftest.c >&5
configure:6810: $? = 0
configure:6814: /opt/local/bin/nm conftest.o \| sed -n -e 's/^.*[ ]\([BCDEGRST][BCDEGRST]*\)[ ][ ]*_\([_A-Za-z][_A-Za-z0-9]*\)$/\1 _\2 \2/p' | sed '/ __gnu_lto/d' \> conftest.nm
configure:6817: $? = 0
configure:6883: gcc -o conftest -O2 -arch i386 -O2 -arch i386 -O2 -arch i386 -O2 -arch i386 -I/Users/lexy0922/filezilla/libidn/include -I/Users/lexy0922/filezilla/libidn/include -arch i386 -L/Users/lexy0922/filezilla/libidn/lib -arch i386 -arch i386 -L/Users/lexy0922/filezilla/libidn/lib -arch i386 conftest.c conftstm.o >&5
configure:6886: $? = 0
configure:6924: result: ok
configure:6961: checking for sysroot
configure:6991: result: no
configure:7260: checking for mt
configure:7290: result: no
configure:7310: checking if : is a manifest tool
configure:7316: : '-?'
configure:7324: result: no
configure:7380: checking for dsymutil
configure:7396: found /usr/bin/dsymutil
configure:7407: result: dsymutil
configure:7472: checking for nmedit
configure:7488: found /opt/local/bin/nmedit
configure:7499: result: nmedit
configure:7564: checking for lipo
configure:7580: found /opt/local/bin/lipo
configure:7591: result: lipo
configure:7656: checking for otool
configure:7672: found /opt/local/bin/otool
configure:7683: result: otool
configure:7748: checking for otool64
configure:7778: result: no
configure:7823: checking for -single_module linker flag
gcc -O2 -arch i386 -O2 -arch i386 -O2 -arch i386 -O2 -arch i386 -arch i386 -L/Users/lexy0922/filezilla/libidn/lib -arch i386 -arch i386 -L/Users/lexy0922/filezilla/libidn/lib -arch i386 -o libconftest.dylib -dynamiclib -Wl,-single_module conftest.c
configure:7856: result: yes
configure:7859: checking for -exported_symbols_list linker flag
configure:7879: gcc -o conftest -O2 -arch i386 -O2 -arch i386 -O2 -arch i386 -O2 -arch i386 -I/Users/lexy0922/filezilla/libidn/include -I/Users/lexy0922/filezilla/libidn/include -arch i386 -L/Users/lexy0922/filezilla/libidn/lib -arch i386 -arch i386 -L/Users/lexy0922/filezilla/libidn/lib -arch i386 -Wl,-exported_symbols_list,conftest.sym conftest.c >&5
configure:7879: $? = 0
configure:7889: result: yes
configure:7892: checking for -force_load linker flag
gcc -O2 -arch i386 -O2 -arch i386 -O2 -arch i386 -O2 -arch i386 -c -o conftest.o conftest.c
ar cru libconftest.a conftest.o
ranlib libconftest.a
gcc -O2 -arch i386 -O2 -arch i386 -O2 -arch i386 -O2 -arch i386 -arch i386 -L/Users/lexy0922/filezilla/libidn/lib -arch i386 -arch i386 -L/Users/lexy0922/filezilla/libidn/lib -arch i386 -o conftest conftest.c -Wl,-force_load,./libconftest.a
configure:7924: result: yes
configure:7966: checking how to run the C preprocessor
configure:7997: gcc -E -I/Users/lexy0922/filezilla/libidn/include -I/Users/lexy0922/filezilla/libidn/include conftest.c
configure:7997: $? = 0
configure:8011: gcc -E -I/Users/lexy0922/filezilla/libidn/include -I/Users/lexy0922/filezilla/libidn/include conftest.c
conftest.c:11:10: fatal error: 'ac_nonexistent.h' file not found
#include <ac_nonexistent.h>
^
1 error generated.
configure:8011: $? = 1
configure: failed program was:
| /* confdefs.h */
| #define PACKAGE_NAME "FileZilla"
| #define PACKAGE_TARNAME "filezilla"
| #define PACKAGE_VERSION "3.9.0.6"
| #define PACKAGE_STRING "FileZilla 3.9.0.6"
| #define PACKAGE_BUGREPORT "tim.kosse@filezilla-project.org"
| #define PACKAGE_URL "https://filezilla-project.org/"
| #define PACKAGE "filezilla"
| #define VERSION "3.9.0.6"
| /* end confdefs.h. */
| #include <ac_nonexistent.h>
configure:8036: result: gcc -E
configure:8056: gcc -E -I/Users/lexy0922/filezilla/libidn/include -I/Users/lexy0922/filezilla/libidn/include conftest.c
configure:8056: $? = 0
configure:8070: gcc -E -I/Users/lexy0922/filezilla/libidn/include -I/Users/lexy0922/filezilla/libidn/include conftest.c
conftest.c:11:10: fatal error: 'ac_nonexistent.h' file not found
#include <ac_nonexistent.h>
^
1 error generated.
configure:8070: $? = 1
configure: failed program was:
| /* confdefs.h */
| #define PACKAGE_NAME "FileZilla"
| #define PACKAGE_TARNAME "filezilla"
| #define PACKAGE_VERSION "3.9.0.6"
| #define PACKAGE_STRING "FileZilla 3.9.0.6"
| #define PACKAGE_BUGREPORT "tim.kosse@filezilla-project.org"
| #define PACKAGE_URL "https://filezilla-project.org/"
| #define PACKAGE "filezilla"
| #define VERSION "3.9.0.6"
| /* end confdefs.h. */
| #include <ac_nonexistent.h>
configure:8099: checking for ANSI C header files
configure:8119: gcc -c -O2 -arch i386 -O2 -arch i386 -O2 -arch i386 -O2 -arch i386 -I/Users/lexy0922/filezilla/libidn/include -I/Users/lexy0922/filezilla/libidn/include conftest.c >&5
configure:8119: $? = 0
configure:8192: gcc -o conftest -O2 -arch i386 -O2 -arch i386 -O2 -arch i386 -O2 -arch i386 -I/Users/lexy0922/filezilla/libidn/include -I/Users/lexy0922/filezilla/libidn/include -arch i386 -L/Users/lexy0922/filezilla/libidn/lib -arch i386 -arch i386 -L/Users/lexy0922/filezilla/libidn/lib -arch i386 conftest.c >&5
configure:8192: $? = 0
configure:8192: ./conftest
configure:8192: $? = 0
configure:8203: result: yes
configure:8216: checking for sys/types.h
configure:8216: gcc -c -O2 -arch i386 -O2 -arch i386 -O2 -arch i386 -O2 -arch i386 -I/Users/lexy0922/filezilla/libidn/include -I/Users/lexy0922/filezilla/libidn/include conftest.c >&5
configure:8216: $? = 0
configure:8216: result: yes
configure:8216: checking for sys/stat.h
configure:8216: gcc -c -O2 -arch i386 -O2 -arch i386 -O2 -arch i386 -O2 -arch i386 -I/Users/lexy0922/filezilla/libidn/include -I/Users/lexy0922/filezilla/libidn/include conftest.c >&5
configure:8216: $? = 0
configure:8216: result: yes
configure:8216: checking for stdlib.h
configure:8216: gcc -c -O2 -arch i386 -O2 -arch i386 -O2 -arch i386 -O2 -arch i386 -I/Users/lexy0922/filezilla/libidn/include -I/Users/lexy0922/filezilla/libidn/include conftest.c >&5
configure:8216: $? = 0
configure:8216: result: yes
configure:8216: checking for string.h
configure:8216: gcc -c -O2 -arch i386 -O2 -arch i386 -O2 -arch i386 -O2 -arch i386 -I/Users/lexy0922/filezilla/libidn/include -I/Users/lexy0922/filezilla/libidn/include conftest.c >&5
configure:8216: $? = 0
configure:8216: result: yes
configure:8216: checking for memory.h
configure:8216: gcc -c -O2 -arch i386 -O2 -arch i386 -O2 -arch i386 -O2 -arch i386 -I/Users/lexy0922/filezilla/libidn/include -I/Users/lexy0922/filezilla/libidn/include conftest.c >&5
configure:8216: $? = 0
configure:8216: result: yes
configure:8216: checking for strings.h
configure:8216: gcc -c -O2 -arch i386 -O2 -arch i386 -O2 -arch i386 -O2 -arch i386 -I/Users/lexy0922/filezilla/libidn/include -I/Users/lexy0922/filezilla/libidn/include conftest.c >&5
configure:8216: $? = 0
configure:8216: result: yes
configure:8216: checking for inttypes.h
configure:8216: gcc -c -O2 -arch i386 -O2 -arch i386 -O2 -arch i386 -O2 -arch i386 -I/Users/lexy0922/filezilla/libidn/include -I/Users/lexy0922/filezilla/libidn/include conftest.c >&5
configure:8216: $? = 0
configure:8216: result: yes
configure:8216: checking for stdint.h
configure:8216: gcc -c -O2 -arch i386 -O2 -arch i386 -O2 -arch i386 -O2 -arch i386 -I/Users/lexy0922/filezilla/libidn/include -I/Users/lexy0922/filezilla/libidn/include conftest.c >&5
configure:8216: $? = 0
configure:8216: result: yes
configure:8216: checking for unistd.h
configure:8216: gcc -c -O2 -arch i386 -O2 -arch i386 -O2 -arch i386 -O2 -arch i386 -I/Users/lexy0922/filezilla/libidn/include -I/Users/lexy0922/filezilla/libidn/include conftest.c >&5
configure:8216: $? = 0
configure:8216: result: yes
configure:8230: checking for dlfcn.h
configure:8230: gcc -c -O2 -arch i386 -O2 -arch i386 -O2 -arch i386 -O2 -arch i386 -I/Users/lexy0922/filezilla/libidn/include -I/Users/lexy0922/filezilla/libidn/include conftest.c >&5
configure:8230: $? = 0
configure:8230: result: yes
configure:8447: checking for objdir
configure:8462: result: .libs
configure:8733: checking if gcc supports -fno-rtti -fno-exceptions
configure:8751: gcc -c -O2 -arch i386 -O2 -arch i386 -O2 -arch i386 -O2 -arch i386 -I/Users/lexy0922/filezilla/libidn/include -I/Users/lexy0922/filezilla/libidn/include -fno-rtti -fno-exceptions conftest.c >&5
configure:8755: $? = 0
configure:8768: result: yes
configure:9095: checking for gcc option to produce PIC
configure:9102: result: -fno-common -DPIC
configure:9110: checking if gcc PIC flag -fno-common -DPIC works
configure:9128: gcc -c -O2 -arch i386 -O2 -arch i386 -O2 -arch i386 -O2 -arch i386 -I/Users/lexy0922/filezilla/libidn/include -I/Users/lexy0922/filezilla/libidn/include -fno-common -DPIC -DPIC conftest.c >&5
configure:9132: $? = 0
configure:9145: result: yes
configure:9174: checking if gcc static flag -static works
configure:9202: result: no
configure:9217: checking if gcc supports -c -o file.o
configure:9238: gcc -c -O2 -arch i386 -O2 -arch i386 -O2 -arch i386 -O2 -arch i386 -I/Users/lexy0922/filezilla/libidn/include -I/Users/lexy0922/filezilla/libidn/include -o out/conftest2.o conftest.c >&5
configure:9242: $? = 0
configure:9264: result: yes
configure:9272: checking if gcc supports -c -o file.o
configure:9319: result: yes
configure:9352: checking whether the gcc linker (/Applications/Xcode.app/Contents/Developer/Toolchains/XcodeDefault.xctoolchain/usr/bin/ld) supports shared libraries
configure:10509: result: yes
configure:10749: checking dynamic linker characteristics
configure:11483: result: darwin13.4.0 dyld
configure:11590: checking how to hardcode library paths into programs
configure:11615: result: immediate
configure:12155: checking whether stripping libraries is possible
configure:12169: result: yes
configure:12195: checking if libtool supports shared libraries
configure:12197: result: yes
configure:12200: checking whether to build shared libraries
configure:12221: result: yes
configure:12224: checking whether to build static libraries
configure:12228: result: yes
configure:12251: checking how to run the C++ preprocessor
configure:12278: g++ -E -I/Users/lexy0922/filezilla/libidn/include -I/Users/lexy0922/filezilla/libidn/include conftest.cpp
configure:12278: $? = 0
configure:12292: g++ -E -I/Users/lexy0922/filezilla/libidn/include -I/Users/lexy0922/filezilla/libidn/include conftest.cpp
conftest.cpp:23:10: fatal error: 'ac_nonexistent.h' file not found
#include <ac_nonexistent.h>
^
1 error generated.
configure:12292: $? = 1
configure: failed program was:
| /* confdefs.h */
| #define PACKAGE_NAME "FileZilla"
| #define PACKAGE_TARNAME "filezilla"
| #define PACKAGE_VERSION "3.9.0.6"
| #define PACKAGE_STRING "FileZilla 3.9.0.6"
| #define PACKAGE_BUGREPORT "tim.kosse@filezilla-project.org"
| #define PACKAGE_URL "https://filezilla-project.org/"
| #define PACKAGE "filezilla"
| #define VERSION "3.9.0.6"
| #define STDC_HEADERS 1
| #define HAVE_SYS_TYPES_H 1
| #define HAVE_SYS_STAT_H 1
| #define HAVE_STDLIB_H 1
| #define HAVE_STRING_H 1
| #define HAVE_MEMORY_H 1
| #define HAVE_STRINGS_H 1
| #define HAVE_INTTYPES_H 1
| #define HAVE_STDINT_H 1
| #define HAVE_UNISTD_H 1
| #define HAVE_DLFCN_H 1
| #define LT_OBJDIR ".libs/"
| /* end confdefs.h. */
| #include <ac_nonexistent.h>
configure:12317: result: g++ -E
configure:12337: g++ -E -I/Users/lexy0922/filezilla/libidn/include -I/Users/lexy0922/filezilla/libidn/include conftest.cpp
configure:12337: $? = 0
configure:12351: g++ -E -I/Users/lexy0922/filezilla/libidn/include -I/Users/lexy0922/filezilla/libidn/include conftest.cpp
conftest.cpp:23:10: fatal error: 'ac_nonexistent.h' file not found
#include <ac_nonexistent.h>
^
1 error generated.
configure:12351: $? = 1
configure: failed program was:
| /* confdefs.h */
| #define PACKAGE_NAME "FileZilla"
| #define PACKAGE_TARNAME "filezilla"
| #define PACKAGE_VERSION "3.9.0.6"
| #define PACKAGE_STRING "FileZilla 3.9.0.6"
| #define PACKAGE_BUGREPORT "tim.kosse@filezilla-project.org"
| #define PACKAGE_URL "https://filezilla-project.org/"
| #define PACKAGE "filezilla"
| #define VERSION "3.9.0.6"
| #define STDC_HEADERS 1
| #define HAVE_SYS_TYPES_H 1
| #define HAVE_SYS_STAT_H 1
| #define HAVE_STDLIB_H 1
| #define HAVE_STRING_H 1
| #define HAVE_MEMORY_H 1
| #define HAVE_STRINGS_H 1
| #define HAVE_INTTYPES_H 1
| #define HAVE_STDINT_H 1
| #define HAVE_UNISTD_H 1
| #define HAVE_DLFCN_H 1
| #define LT_OBJDIR ".libs/"
| /* end confdefs.h. */
| #include <ac_nonexistent.h>
configure:12520: checking for ld used by g++
configure:12587: result: /Applications/Xcode.app/Contents/Developer/Toolchains/XcodeDefault.xctoolchain/usr/bin/ld
configure:12594: checking if the linker (/Applications/Xcode.app/Contents/Developer/Toolchains/XcodeDefault.xctoolchain/usr/bin/ld) is GNU ld
configure:12609: result: no
configure:12664: checking whether the g++ linker (/Applications/Xcode.app/Contents/Developer/Toolchains/XcodeDefault.xctoolchain/usr/bin/ld) supports shared libraries
configure:13666: result: yes
configure:13702: g++ -c -O2 -arch i386 -O2 -arch i386 -O2 -arch i386 -O2 -arch i386 -O2 -arch i386 -O2 -arch i386 -O2 -arch i386 -O2 -arch i386 -O2 -arch i386 -O2 -arch i386 -I/Users/lexy0922/filezilla/libidn/include -I/Users/lexy0922/filezilla/libidn/include conftest.cpp >&5
configure:13705: $? = 0
configure:14225: checking for g++ option to produce PIC
configure:14232: result: -fno-common -DPIC
configure:14240: checking if g++ PIC flag -fno-common -DPIC works
configure:14258: g++ -c -O2 -arch i386 -O2 -arch i386 -O2 -arch i386 -O2 -arch i386 -O2 -arch i386 -O2 -arch i386 -O2 -arch i386 -O2 -arch i386 -O2 -arch i386 -O2 -arch i386 -I/Users/lexy0922/filezilla/libidn/include -I/Users/lexy0922/filezilla/libidn/include -fno-common -DPIC -DPIC conftest.cpp >&5
configure:14262: $? = 0
configure:14275: result: yes
configure:14298: checking if g++ static flag -static works
configure:14326: result: no
configure:14338: checking if g++ supports -c -o file.o
configure:14359: g++ -c -O2 -arch i386 -O2 -arch i386 -O2 -arch i386 -O2 -arch i386 -O2 -arch i386 -O2 -arch i386 -O2 -arch i386 -O2 -arch i386 -O2 -arch i386 -O2 -arch i386 -I/Users/lexy0922/filezilla/libidn/include -I/Users/lexy0922/filezilla/libidn/include -o out/conftest2.o conftest.cpp >&5
configure:14363: $? = 0
configure:14385: result: yes
configure:14390: checking if g++ supports -c -o file.o
configure:14437: result: yes
configure:14467: checking whether the g++ linker (/Applications/Xcode.app/Contents/Developer/Toolchains/XcodeDefault.xctoolchain/usr/bin/ld) supports shared libraries
configure:14506: result: yes
configure:14647: checking dynamic linker characteristics
configure:15315: result: darwin13.4.0 dyld
configure:15368: checking how to hardcode library paths into programs
configure:15393: result: immediate
configure:15603: checking whether g++ supports C++11 features by default
configure:15637: g++ -c -O2 -arch i386 -O2 -arch i386 -O2 -arch i386 -O2 -arch i386 -O2 -arch i386 -O2 -arch i386 -O2 -arch i386 -O2 -arch i386 -O2 -arch i386 -O2 -arch i386 -Wall -g -fexceptions -I/Users/lexy0922/filezilla/libidn/include -I/Users/lexy0922/filezilla/libidn/include conftest.cpp >&5
conftest.cpp:27:21: error: expected parameter declarator
static_assert(sizeof(int) <= sizeof(T), "not big enough");
^
conftest.cpp:27:21: error: expected ')'
conftest.cpp:27:20: note: to match this '('
static_assert(sizeof(int) <= sizeof(T), "not big enough");
^
conftest.cpp:27:7: error: C++ requires a type specifier for all declarations
static_assert(sizeof(int) <= sizeof(T), "not big enough");
^~~~~~~~~~~~~
conftest.cpp:34:22: warning: 'override' keyword is a C++11 extension [-Wc++11-extensions]
virtual void f() override {}
^
conftest.cpp:37:29: error: a space is required between consecutive right angle brackets (use '> >')
typedef check<check<bool>> right_angle_brackets;
^~
> >
conftest.cpp:40:5: error: unknown type name 'decltype'
decltype(a) b;
^
conftest.cpp:40:16: error: expected ';' after top level declarator
decltype(a) b;
^
;
conftest.cpp:44:15: warning: rvalue references are a C++11 extension [-Wc++11-extensions]
check_type&& cr = static_cast<check_type&&>(c);
^
conftest.cpp:44:45: warning: rvalue references are a C++11 extension [-Wc++11-extensions]
check_type&& cr = static_cast<check_type&&>(c);
^
conftest.cpp:46:5: warning: 'auto' type specifier is a C++11 extension [-Wc++11-extensions]
auto d = a;
^
conftest.cpp:47:5: warning: 'auto' type specifier is a C++11 extension [-Wc++11-extensions]
auto l = [](){};
^
conftest.cpp:47:14: error: expected expression
auto l = [](){};
^
5 warnings and 7 errors generated.
configure:15637: $? = 1
configure: failed program was:
| /* confdefs.h */
| #define PACKAGE_NAME "FileZilla"
| #define PACKAGE_TARNAME "filezilla"
| #define PACKAGE_VERSION "3.9.0.6"
| #define PACKAGE_STRING "FileZilla 3.9.0.6"
| #define PACKAGE_BUGREPORT "tim.kosse@filezilla-project.org"
| #define PACKAGE_URL "https://filezilla-project.org/"
| #define PACKAGE "filezilla"
| #define VERSION "3.9.0.6"
| #define STDC_HEADERS 1
| #define HAVE_SYS_TYPES_H 1
| #define HAVE_SYS_STAT_H 1
| #define HAVE_STDLIB_H 1
| #define HAVE_STRING_H 1
| #define HAVE_MEMORY_H 1
| #define HAVE_STRINGS_H 1
| #define HAVE_INTTYPES_H 1
| #define HAVE_STDINT_H 1
| #define HAVE_UNISTD_H 1
| #define HAVE_DLFCN_H 1
| #define LT_OBJDIR ".libs/"
| /* end confdefs.h. */
|
| template <typename T>
| struct check
| {
| static_assert(sizeof(int) <= sizeof(T), "not big enough");
| };
|
| struct Base {
| virtual void f() {}
| };
| struct Child : public Base {
| virtual void f() override {}
| };
|
| typedef check<check<bool>> right_angle_brackets;
|
| int a;
| decltype(a) b;
|
| typedef check<int> check_type;
| check_type c;
| check_type&& cr = static_cast<check_type&&>(c);
|
| auto d = a;
| auto l = [](){};
|
configure:15644: result: no
configure:15653: checking whether g++ supports C++11 features with -std=gnu++11
configure:15689: g++ -c -O2 -arch i386 -O2 -arch i386 -O2 -arch i386 -O2 -arch i386 -O2 -arch i386 -O2 -arch i386 -O2 -arch i386 -O2 -arch i386 -O2 -arch i386 -O2 -arch i386 -Wall -g -fexceptions -std=gnu++11 -I/Users/lexy0922/filezilla/libidn/include -I/Users/lexy0922/filezilla/libidn/include conftest.cpp >&5
conftest.cpp:47:10: warning: unused variable 'l' [-Wunused-variable]
auto l = [](){};
^
1 warning generated.
configure:15689: $? = 0
configure:15698: result: yes
configure:15799: checking for whether we need -stdlib=libc++
configure:15821: g++ -c -O2 -arch i386 -O2 -arch i386 -O2 -arch i386 -O2 -arch i386 -O2 -arch i386 -O2 -arch i386 -O2 -arch i386 -O2 -arch i386 -O2 -arch i386 -O2 -arch i386 -Wall -g -fexceptions -std=gnu++11 -I/Users/lexy0922/filezilla/libidn/include -I/Users/lexy0922/filezilla/libidn/include conftest.cpp >&5
configure:15821: $? = 0
configure:15823: result: no
configure:15884: checking for whether we can include <unordered_map>
configure:15904: g++ -c -O2 -arch i386 -O2 -arch i386 -O2 -arch i386 -O2 -arch i386 -O2 -arch i386 -O2 -arch i386 -O2 -arch i386 -O2 -arch i386 -O2 -arch i386 -O2 -arch i386 -Wall -g -fexceptions -std=gnu++11 -I/Users/lexy0922/filezilla/libidn/include -I/Users/lexy0922/filezilla/libidn/include conftest.cpp >&5
configure:15904: $? = 0
configure:15906: result: yes
configure:16057: checking for wx-config
configure:16076: found /Users/lexy0922/filezilla/wxMac/bin/wx-config
configure:16089: result: /Users/lexy0922/filezilla/wxMac/bin/wx-config
configure:16107: checking for wxWidgets version >= 3.0.1 (--unicode=yes --universal=no)
configure:16150: result: yes (version 3.0.1)
configure:16154: checking for wxWidgets static library
configure:16158: result: no
configure:16320: checking positional printf argument support in wxWidgets
configure:16339: g++ -E -I/Users/lexy0922/filezilla/libidn/include -I/Users/lexy0922/filezilla/libidn/include -I/Users/lexy0922/filezilla/wxMac/lib/wx/include/osx_cocoa-unicode-3.0 -I/Users/lexy0922/filezilla/wxMac/include/wx-3.0 -D_FILE_OFFSET_BITS=64 -DWXUSINGDLL -D__WXMAC__ -D__WXOSX__ -D__WXOSX_COCOA__ conftest.cpp
In file included from conftest.cpp:28:
In file included from /Users/lexy0922/filezilla/wxMac/include/wx-3.0/wx/wx.h:15:
In file included from /Users/lexy0922/filezilla/wxMac/include/wx-3.0/wx/object.h:19:
In file included from /Users/lexy0922/filezilla/wxMac/include/wx-3.0/wx/memory.h:15:
In file included from /Users/lexy0922/filezilla/wxMac/include/wx-3.0/wx/string.h:46:
/Users/lexy0922/filezilla/wxMac/include/wx-3.0/wx/strvararg.h:30:18: fatal error: 'tr1/type_traits' file not found
#include <tr1/type_traits>
^
1 error generated.
configure:16339: $? = 1
configure: failed program was:
| /* confdefs.h */
| #define PACKAGE_NAME "FileZilla"
| #define PACKAGE_TARNAME "filezilla"
| #define PACKAGE_VERSION "3.9.0.6"
| #define PACKAGE_STRING "FileZilla 3.9.0.6"
| #define PACKAGE_BUGREPORT "tim.kosse@filezilla-project.org"
| #define PACKAGE_URL "https://filezilla-project.org/"
| #define PACKAGE "filezilla"
| #define VERSION "3.9.0.6"
| #define STDC_HEADERS 1
| #define HAVE_SYS_TYPES_H 1
| #define HAVE_SYS_STAT_H 1
| #define HAVE_STDLIB_H 1
| #define HAVE_STRING_H 1
| #define HAVE_MEMORY_H 1
| #define HAVE_STRINGS_H 1
| #define HAVE_INTTYPES_H 1
| #define HAVE_STDINT_H 1
| #define HAVE_UNISTD_H 1
| #define HAVE_DLFCN_H 1
| #define LT_OBJDIR ".libs/"
| #define USED_HOST "x86_64-apple-darwin13.4.0"
| #define USED_BUILD "x86_64-apple-darwin13.4.0"
| #define USED_CXXFLAGS " -O2 -arch i386 -O2 -arch i386 -O2 -arch i386 -O2 -arch i386 -O2 -arch i386 -O2 -arch i386 -O2 -arch i386 -O2 -arch i386 -O2 -arch i386 -O2 -arch i386 -Wall -g -fexceptions -std=gnu++11"
| #define USED_COMPILER "Apple LLVM version 5.1 (clang-503.0.40) (based on LLVM 3.4svn)"
| /* end confdefs.h. */
|
| #include <wx/wx.h>
| #if !wxUSE_PRINTF_POS_PARAMS
| #error wx compiled without wxUSE_PRINTF_POS_PARAMS
| #endif
|
| int
| main ()
| {
|
| ;
| return 0;
| }
configure:16344: result: no
configure:16346: error: in `/Users/lexy0922/Filezilla_project/filezilla-3.9.0.6':
configure:16348: error: Positional printf argument support in wxWidgets is required by FileZilla. Please rebuild wxWidgets and pass --enable-printfposparam to its configure script.
See `config.log' for more details

## ---------------- ##
## Cache variables. ##
## ---------------- ##

ac_cv_build=x86_64-apple-darwin13.4.0
ac_cv_c_compiler_gnu=yes
ac_cv_cxx_compiler_gnu=yes
ac_cv_env_CCC_set=
ac_cv_env_CCC_value=
ac_cv_env_CC_set=
ac_cv_env_CC_value=
ac_cv_env_CFLAGS_set=set
ac_cv_env_CFLAGS_value=' -O2 -arch i386 -O2 -arch i386 -O2 -arch i386 -O2 -arch i386'
ac_cv_env_CPPFLAGS_set=set
ac_cv_env_CPPFLAGS_value=' -I/Users/lexy0922/filezilla/libidn/include -I/Users/lexy0922/filezilla/libidn/include'
ac_cv_env_CPP_set=
ac_cv_env_CPP_value=
ac_cv_env_CXXCPP_set=
ac_cv_env_CXXCPP_value=
ac_cv_env_CXXFLAGS_set=set
ac_cv_env_CXXFLAGS_value=' -O2 -arch i386 -O2 -arch i386 -O2 -arch i386 -O2 -arch i386 -O2 -arch i386 -O2 -arch i386 -O2 -arch i386 -O2 -arch i386 -O2 -arch i386 -O2 -arch i386'
ac_cv_env_CXX_set=
ac_cv_env_CXX_value=
ac_cv_env_LDFLAGS_set=set
ac_cv_env_LDFLAGS_value=' -arch i386 -L/Users/lexy0922/filezilla/libidn/lib -arch i386 -arch i386 -L/Users/lexy0922/filezilla/libidn/lib -arch i386'
ac_cv_env_LIBDBUS_CFLAGS_set=
ac_cv_env_LIBDBUS_CFLAGS_value=
ac_cv_env_LIBDBUS_LIBS_set=
ac_cv_env_LIBDBUS_LIBS_value=
ac_cv_env_LIBGNUTLS_CFLAGS_set=
ac_cv_env_LIBGNUTLS_CFLAGS_value=
ac_cv_env_LIBGNUTLS_LIBS_set=
ac_cv_env_LIBGNUTLS_LIBS_value=
ac_cv_env_LIBGTK_CFLAGS_set=
ac_cv_env_LIBGTK_CFLAGS_value=
ac_cv_env_LIBGTK_LIBS_set=
ac_cv_env_LIBGTK_LIBS_value=
ac_cv_env_LIBSQLITE3_CFLAGS_set=
ac_cv_env_LIBSQLITE3_CFLAGS_value=
ac_cv_env_LIBSQLITE3_LIBS_set=
ac_cv_env_LIBSQLITE3_LIBS_value=
ac_cv_env_LIBS_set=
ac_cv_env_LIBS_value=
ac_cv_env_PKG_CONFIG_LIBDIR_set=
ac_cv_env_PKG_CONFIG_LIBDIR_value=
ac_cv_env_PKG_CONFIG_PATH_set=set
ac_cv_env_PKG_CONFIG_PATH_value=/Users/lexy0922/filezilla/gnutls/lib/pkgconfig:/Users/lexy0922/filezilla/sqlite/lib/pkgconfig
ac_cv_env_PKG_CONFIG_set=
ac_cv_env_PKG_CONFIG_value=
ac_cv_env_build_alias_set=
ac_cv_env_build_alias_value=
ac_cv_env_host_alias_set=
ac_cv_env_host_alias_value=
ac_cv_env_target_alias_set=
ac_cv_env_target_alias_value=
ac_cv_header_dlfcn_h=yes
ac_cv_header_inttypes_h=yes
ac_cv_header_memory_h=yes
ac_cv_header_stdc=yes
ac_cv_header_stdint_h=yes
ac_cv_header_stdlib_h=yes
ac_cv_header_string_h=yes
ac_cv_header_strings_h=yes
ac_cv_header_sys_stat_h=yes
ac_cv_header_sys_types_h=yes
ac_cv_header_unistd_h=yes
ac_cv_host=x86_64-apple-darwin13.4.0
ac_cv_objext=o
ac_cv_path_EGREP='/usr/bin/grep -E'
ac_cv_path_FGREP='/usr/bin/grep -F'
ac_cv_path_GREP=/usr/bin/grep
ac_cv_path_SED=/usr/bin/sed
ac_cv_path_WX_CONFIG_PATH=/Users/lexy0922/filezilla/wxMac/bin/wx-config
ac_cv_path_install='/usr/bin/install -c'
ac_cv_prog_AWK=awk
ac_cv_prog_CPP='gcc -E'
ac_cv_prog_CXXCPP='g++ -E'
ac_cv_prog_ac_ct_AR=ar
ac_cv_prog_ac_ct_CC=gcc
ac_cv_prog_ac_ct_CXX=g++
ac_cv_prog_ac_ct_DSYMUTIL=dsymutil
ac_cv_prog_ac_ct_LIPO=lipo
ac_cv_prog_ac_ct_NMEDIT=nmedit
ac_cv_prog_ac_ct_OTOOL=otool
ac_cv_prog_ac_ct_RANLIB=ranlib
ac_cv_prog_ac_ct_STRIP=strip
ac_cv_prog_cc_c89=
ac_cv_prog_cc_g=yes
ac_cv_prog_cxx_g=yes
ac_cv_prog_make_make_set=yes
am_cv_CC_dependencies_compiler_type=gcc3
am_cv_CXX_dependencies_compiler_type=gcc3
am_cv_make_support_nested_variables=yes
am_cv_prog_cc_c_o=yes
ax_cv_cxx_compile_cxx11=no
ax_cv_cxx_compile_cxx11__std_gnupp11=yes
lt_cv_apple_cc_single_mod=yes
lt_cv_ar_at_file=no
lt_cv_deplibs_check_method=pass_all
lt_cv_file_magic_cmd='$MAGIC_CMD'
lt_cv_file_magic_test_file=
lt_cv_ld_exported_symbols_list=yes
lt_cv_ld_force_load=yes
lt_cv_ld_reload_flag=-r
lt_cv_nm_interface='BSD nm'
lt_cv_objdir=.libs
lt_cv_path_LD=/Applications/Xcode.app/Contents/Developer/Toolchains/XcodeDefault.xctoolchain/usr/bin/ld
lt_cv_path_LDCXX=/Applications/Xcode.app/Contents/Developer/Toolchains/XcodeDefault.xctoolchain/usr/bin/ld
lt_cv_path_NM=/opt/local/bin/nm
lt_cv_path_mainfest_tool=no
lt_cv_prog_compiler_c_o=yes
lt_cv_prog_compiler_c_o_CXX=yes
lt_cv_prog_compiler_pic='-fno-common -DPIC'
lt_cv_prog_compiler_pic_CXX='-fno-common -DPIC'
lt_cv_prog_compiler_pic_works=yes
lt_cv_prog_compiler_pic_works_CXX=yes
lt_cv_prog_compiler_rtti_exceptions=yes
lt_cv_prog_compiler_static_works=no
lt_cv_prog_compiler_static_works_CXX=no
lt_cv_prog_gnu_ld=no
lt_cv_prog_gnu_ldcxx=no
lt_cv_sharedlib_from_linklib_cmd='printf %s\n'
lt_cv_sys_global_symbol_pipe='sed -n -e '\''s/^.*[ ]\([BCDEGRST][BCDEGRST]*\)[ ][ ]*_\([_A-Za-z][_A-Za-z0-9]*\)$/\1 _\2 \2/p'\'' | sed '\''/ __gnu_lto/d'\'''
lt_cv_sys_global_symbol_to_c_name_address='sed -n -e '\''s/^: \([^ ]*\)[ ]*$/ {\"\1\", (void *) 0},/p'\'' -e '\''s/^[BCDEGRST]* \([^ ]*\) \([^ ]*\)$/ {"\2", (void *) \&\2},/p'\'''
lt_cv_sys_global_symbol_to_c_name_address_lib_prefix='sed -n -e '\''s/^: \([^ ]*\)[ ]*$/ {\"\1\", (void *) 0},/p'\'' -e '\''s/^[BCDEGRST]* \([^ ]*\) \(lib[^ ]*\)$/ {"\2", (void *) \&\2},/p'\'' -e '\''s/^[BCDEGRST]* \([^ ]*\) \([^ ]*\)$/ {"lib\2", (void *) \&\2},/p'\'''
lt_cv_sys_global_symbol_to_cdecl='sed -n -e '\''s/^T .* \(.*\)$/extern int \1();/p'\'' -e '\''s/^[BCDEGRST]* .* \(.*\)$/extern char \1;/p'\'''
lt_cv_sys_max_cmd_len=196608
lt_cv_to_host_file_cmd=func_convert_file_noop
lt_cv_to_tool_file_cmd=func_convert_file_noop

## ----------------- ##
## Output variables. ##
## ----------------- ##

ACLOCAL='${SHELL} /Users/lexy0922/Filezilla_project/filezilla-3.9.0.6/config/missing aclocal-1.14'
AMDEPBACKSLASH='\'
AMDEP_FALSE='#'
AMDEP_TRUE=''
AMTAR='$${TAR-tar}'
AM_BACKSLASH='\'
AM_DEFAULT_V='$(AM_DEFAULT_VERBOSITY)'
AM_DEFAULT_VERBOSITY='1'
AM_V='$(V)'
AR='ar'
AUTOCONF='${SHELL} /Users/lexy0922/Filezilla_project/filezilla-3.9.0.6/config/missing autoconf'
AUTOHEADER='${SHELL} /Users/lexy0922/Filezilla_project/filezilla-3.9.0.6/config/missing autoheader'
AUTOMAKE='${SHELL} /Users/lexy0922/Filezilla_project/filezilla-3.9.0.6/config/missing automake-1.14'
AWK='awk'
CC='gcc'
CCDEPMODE='depmode=gcc3'
CFLAGS=' -O2 -arch i386 -O2 -arch i386 -O2 -arch i386 -O2 -arch i386 -Wall -g -fexceptions'
CPP='gcc -E'
CPPFLAGS=' -I/Users/lexy0922/filezilla/libidn/include -I/Users/lexy0922/filezilla/libidn/include -I/Users/lexy0922/filezilla/wxMac/lib/wx/include/osx_cocoa-unicode-3.0 -I/Users/lexy0922/filezilla/wxMac/include/wx-3.0 -D_FILE_OFFSET_BITS=64 -DWXUSINGDLL -D__WXMAC__ -D__WXOSX__ -D__WXOSX_COCOA__'
CPPUNIT_CFLAGS=''
CPPUNIT_CONFIG=''
CPPUNIT_LIBS=''
CXX='g++'
CXXCPP='g++ -E'
CXXDEPMODE='depmode=gcc3'
CXXFLAGS=' -O2 -arch i386 -O2 -arch i386 -O2 -arch i386 -O2 -arch i386 -O2 -arch i386 -O2 -arch i386 -O2 -arch i386 -O2 -arch i386 -O2 -arch i386 -O2 -arch i386 -Wall -g -fexceptions -std=gnu++11'
CYGPATH_W='echo'
DEFS=''
DEPDIR='.deps'
DLLTOOL='false'
DSYMUTIL='dsymutil'
DUMPBIN=''
ECHO_C='\c'
ECHO_N=''
ECHO_T=''
EGREP='/usr/bin/grep -E'
ENABLE_PRECOMP_FALSE=''
ENABLE_PRECOMP_TRUE=''
EXEEXT=''
FGREP='/usr/bin/grep -F'
FILEZILLA_LINGUAS=''
FILEZILLA_LINGUAS_MO=''
FILEZILLA_LINGUAS_PO=''
FILEZILLA_LINGUAS_PO_NEW=''
GREP='/usr/bin/grep'
HAS_CPPUNIT_FALSE=''
HAS_CPPUNIT_TRUE=''
HAVE_CXX11=''
HAVE_DBUS_FALSE=''
HAVE_DBUS_TRUE=''
HAVE_LIBTINYXML_FALSE=''
HAVE_LIBTINYXML_TRUE=''
IDN_LIB=''
INSTALL_DATA='${INSTALL} -m 644'
INSTALL_PROGRAM='${INSTALL}'
INSTALL_SCRIPT='${INSTALL}'
INSTALL_STRIP_PROGRAM='$(install_sh) -c -s'
LD='/Applications/Xcode.app/Contents/Developer/Toolchains/XcodeDefault.xctoolchain/usr/bin/ld'
LDFLAGS=' -arch i386 -L/Users/lexy0922/filezilla/libidn/lib -arch i386 -arch i386 -L/Users/lexy0922/filezilla/libidn/lib -arch i386'
LIBDBUS_CFLAGS=''
LIBDBUS_LIBS=''
LIBGNUTLS_CFLAGS=''
LIBGNUTLS_LIBS=''
LIBGTK_CFLAGS=''
LIBGTK_LIBS=''
LIBOBJS=''
LIBS=''
LIBSQLITE3_CFLAGS=''
LIBSQLITE3_LIBS=''
LIBTOOL='$(SHELL) $(top_builddir)/libtool'
LIPO='lipo'
LN_S='ln -s'
LOCALES_FALSE=''
LOCALES_ONLY_FALSE=''
LOCALES_ONLY_TRUE=''
LOCALES_TRUE=''
LTLIBOBJS=''
MACAPPBUNDLE_FALSE=''
MACAPPBUNDLE_TRUE=''
MAKEINFO='${SHELL} /Users/lexy0922/Filezilla_project/filezilla-3.9.0.6/config/missing makeinfo'
MAKENSISSCRIPT_FALSE=''
MAKENSISSCRIPT_TRUE=''
MANIFEST_TOOL=':'
MINGW_FALSE=''
MINGW_TRUE=''
MKDIR_P='config/install-sh -c -d'
NM='/opt/local/bin/nm'
NMEDIT='nmedit'
OBJDUMP='false'
OBJEXT='o'
OTOOL64=':'
OTOOL='otool'
PACKAGE='filezilla'
PACKAGE_BUGREPORT='tim.kosse@filezilla-project.org'
PACKAGE_NAME='FileZilla'
PACKAGE_STRING='FileZilla 3.9.0.6'
PACKAGE_TARNAME='filezilla'
PACKAGE_URL='https://filezilla-project.org/'
PACKAGE_VERSION='3.9.0.6'
PACKAGE_VERSION_MAJOR=''
PACKAGE_VERSION_MICRO=''
PACKAGE_VERSION_MINOR=''
PACKAGE_VERSION_NANO=''
PATH_SEPARATOR=':'
PKG_CONFIG=''
PKG_CONFIG_LIBDIR=''
PKG_CONFIG_PATH='/Users/lexy0922/filezilla/gnutls/lib/pkgconfig:/Users/lexy0922/filezilla/sqlite/lib/pkgconfig'
RANLIB='ranlib'
SED='/usr/bin/sed'
SET_MAKE=''
SFTP_MINGW_FALSE=''
SFTP_MINGW_TRUE=''
SFTP_UNIX_FALSE=''
SFTP_UNIX_TRUE=''
SHELL='/bin/sh'
STRIP='strip'
TINYXML_LIBS=''
USE_BINRELOC_FALSE=''
USE_BINRELOC_TRUE=''
USE_RESOURCEFILE_FALSE=''
USE_RESOURCEFILE_TRUE=''
VERSION='3.9.0.6'
WINDRES=''
WINDRESFLAGS=''
WXRC=''
WX_CFLAGS='-I/Users/lexy0922/filezilla/wxMac/lib/wx/include/osx_cocoa-unicode-3.0 -I/Users/lexy0922/filezilla/wxMac/include/wx-3.0 -D_FILE_OFFSET_BITS=64 -DWXUSINGDLL -D__WXMAC__ -D__WXOSX__ -D__WXOSX_COCOA__ '
WX_CFLAGS_ONLY=''
WX_CONFIG_PATH='/Users/lexy0922/filezilla/wxMac/bin/wx-config'
WX_CONFIG_WITH_ARGS='/Users/lexy0922/filezilla/wxMac/bin/wx-config --unicode=yes --universal=no'
WX_CPPFLAGS='-I/Users/lexy0922/filezilla/wxMac/lib/wx/include/osx_cocoa-unicode-3.0 -I/Users/lexy0922/filezilla/wxMac/include/wx-3.0 -D_FILE_OFFSET_BITS=64 -DWXUSINGDLL -D__WXMAC__ -D__WXOSX__ -D__WXOSX_COCOA__'
WX_CXXFLAGS='-I/Users/lexy0922/filezilla/wxMac/lib/wx/include/osx_cocoa-unicode-3.0 -I/Users/lexy0922/filezilla/wxMac/include/wx-3.0 -D_FILE_OFFSET_BITS=64 -DWXUSINGDLL -D__WXMAC__ -D__WXOSX__ -D__WXOSX_COCOA__ '
WX_CXXFLAGS_ONLY='-I/Users/lexy0922/filezilla/wxMac/lib/wx/include/osx_cocoa-unicode-3.0 -I/Users/lexy0922/filezilla/wxMac/include/wx-3.0 -D_FILE_OFFSET_BITS=64 -DWXUSINGDLL -D__WXMAC__ -D__WXOSX__ -D__WXOSX_COCOA__'
WX_LIBS='-L/Users/lexy0922/filezilla/wxMac/lib -framework IOKit -framework Carbon -framework Cocoa -framework AudioToolbox -framework System -framework OpenGL -framework QuickTime -lwx_osx_cocoau_aui-3.0 -lwx_osx_cocoau_xrc-3.0 -lwx_osx_cocoau_adv-3.0 -lwx_osx_cocoau_core-3.0 -lwx_baseu_xml-3.0 -lwx_baseu_net-3.0 -lwx_baseu-3.0 '
WX_LIBS_STATIC=''
WX_RESCOMP='cat /dev/null | Rez -d __DARWIN__ -t APPL /Users/lexy0922/filezilla/wxMac/lib/libwx_osx_cocoau-3.0.1.r'
WX_VERSION='3.0.1'
WX_VERSION_MAJOR='3'
WX_VERSION_MICRO='1'
WX_VERSION_MINOR='0'
ac_ct_AR='ar'
ac_ct_CC='gcc'
ac_ct_CXX='g++'
ac_ct_DUMPBIN=''
am__EXEEXT_FALSE=''
am__EXEEXT_TRUE=''
am__fastdepCC_FALSE='#'
am__fastdepCC_TRUE=''
am__fastdepCXX_FALSE='#'
am__fastdepCXX_TRUE=''
am__include='include'
am__isrc=''
am__leading_dot='.'
am__nodep='_no'
am__quote=''
am__tar='$${TAR-tar} chof - "$$tardir"'
am__untar='$${TAR-tar} xf -'
bindir='${exec_prefix}/bin'
build='x86_64-apple-darwin13.4.0'
build_alias=''
build_cpu='x86_64'
build_os='darwin13.4.0'
build_vendor='apple'
datadir='${datarootdir}'
datarootdir='${prefix}/share'
docdir='${datarootdir}/doc/${PACKAGE_TARNAME}'
dvidir='${docdir}'
exec_prefix='NONE'
host='x86_64-apple-darwin13.4.0'
host_alias=''
host_cpu='x86_64'
host_os='darwin13.4.0'
host_vendor='apple'
htmldir='${docdir}'
includedir='${prefix}/include'
infodir='${datarootdir}/info'
install_sh='${SHELL} /Users/lexy0922/Filezilla_project/filezilla-3.9.0.6/config/install-sh'
libdir='${exec_prefix}/lib'
libexecdir='${exec_prefix}/libexec'
localedir='${datarootdir}/locale'
localstatedir='${prefix}/var'
mandir='${datarootdir}/man'
mkdir_p='$(MKDIR_P)'
msgfmt=''
msgmerge=''
oldincludedir='/usr/include'
pdfdir='${docdir}'
prefix='NONE'
program_transform_name='s,x,x,'
psdir='${docdir}'
sbindir='${exec_prefix}/sbin'
sharedstatedir='${prefix}/com'
sysconfdir='${prefix}/etc'
target_alias=''
xdgopen=''
xgettext=''

## ----------- ##
## confdefs.h. ##
## ----------- ##

/* confdefs.h */
#define PACKAGE_NAME "FileZilla"
#define PACKAGE_TARNAME "filezilla"
#define PACKAGE_VERSION "3.9.0.6"
#define PACKAGE_STRING "FileZilla 3.9.0.6"
#define PACKAGE_BUGREPORT "tim.kosse@filezilla-project.org"
#define PACKAGE_URL "https://filezilla-project.org/"
#define PACKAGE "filezilla"
#define VERSION "3.9.0.6"
#define STDC_HEADERS 1
#define HAVE_SYS_TYPES_H 1
#define HAVE_SYS_STAT_H 1
#define HAVE_STDLIB_H 1
#define HAVE_STRING_H 1
#define HAVE_MEMORY_H 1
#define HAVE_STRINGS_H 1
#define HAVE_INTTYPES_H 1
#define HAVE_STDINT_H 1
#define HAVE_UNISTD_H 1
#define HAVE_DLFCN_H 1
#define LT_OBJDIR ".libs/"
#define USED_HOST "x86_64-apple-darwin13.4.0"
#define USED_BUILD "x86_64-apple-darwin13.4.0"
#define USED_CXXFLAGS " -O2 -arch i386 -O2 -arch i386 -O2 -arch i386 -O2 -arch i386 -O2 -arch i386 -O2 -arch i386 -O2 -arch i386 -O2 -arch i386 -O2 -arch i386 -O2 -arch i386 -Wall -g -fexceptions -std=gnu++11"
#define USED_COMPILER "Apple LLVM version 5.1 (clang-503.0.40) (based on LLVM 3.4svn)"

configure: exit 1

User avatar
botg
Site Admin
Posts: 33176
Joined: 2004-02-23 20:49
First name: Tim
Last name: Kosse
Contact:

Re: Compile filezilla 3.9.0.6 under Mac osx

#4 Post by botg » 2014-11-11 15:11

/Users/lexy0922/filezilla/wxMac/include/wx-3.0/wx/strvararg.h:30:18: fatal error: 'tr1/type_traits' file not found
#include <tr1/type_traits>
Odd. Did you compile wxWidgets on your system or did you use a third-party binary package? Or did you upgrade your compiler infrastructure between compiling wx and trying to build FZ?
configure:16107: checking for wxWidgets version >= 3.0.1 (--unicode=yes --universal=no)
configure:16150: result: yes (version 3.0.1)
Outdated. Please update.
Last edited by botg on 2014-11-11 15:17, edited 1 time in total.
Reason: Added another question

cs19
504 Command not implemented
Posts: 10
Joined: 2014-11-11 05:59

Re: Compile filezilla 3.9.0.6 under Mac osx

#5 Post by cs19 » 2014-11-11 15:26

I downloaded wxWidgets-3.0.1.tar.bz2 and used command
../configure --disable-compat26 --enable-unicode --prefix $HOME/filezilla/wxMac --enable-printfposparam && nice make && make install
to compile.

cs19
504 Command not implemented
Posts: 10
Joined: 2014-11-11 05:59

Re: Compile filezilla 3.9.0.6 under Mac osx

#6 Post by cs19 » 2014-11-11 15:27

I also tried the newest version of wxWidgets (3.0.2) and it gave me the same error.

User avatar
botg
Site Admin
Posts: 33176
Joined: 2004-02-23 20:49
First name: Tim
Last name: Kosse
Contact:

Re: Compile filezilla 3.9.0.6 under Mac osx

#7 Post by botg » 2014-11-11 17:32

On OS X there are actually two different C++ standard library implementations, one of them is outdated and hence doesn't work properly. Sadly the broken runtime inexplicitly is the default.

Try this to make sure the proper standard library is used when compiling:
export AS="as -arch i386 -mmacosx-version-min=10.7"
export LD="ld -arch i386 -macosx_version_min 10.7"
export CC="gcc -arch i386 -mmacosx-version-min=10.7"
export CXX="g++ -arch i386 -mmacosx-version-min=10.7 -stdlib=libc++"
With these environment variables in place, rebuild wxWidgets and FileZilla.

cs19
504 Command not implemented
Posts: 10
Joined: 2014-11-11 05:59

Re: Compile filezilla 3.9.0.6 under Mac osx

#8 Post by cs19 » 2014-11-11 19:01

I tried setting these parameters and wxWidget no longer compile...
The error is
checking if C++ compiler (g++ -arch i386 -mmacosx-version-min=10.7 -stdlib=libc++ -mmacosx-version-min=10.5) works with SDK/version options... configure: error: in `/Users/lexy0922/Filezilla_project/wxWidgets-3.0.2/build-wx':
configure: error: no. Try a different SDK
config.log:
This file contains any messages produced by compilers while
running configure, to aid debugging if configure makes a mistake.

It was created by wxWidgets configure 3.0.2, which was
generated by GNU Autoconf 2.69. Invocation command line was

$ ../configure --disable-compat26 --enable-unicode --prefix /Users/lexy0922/filezilla/wxMac --enable-printfposparam

## --------- ##
## Platform. ##
## --------- ##

hostname = sumomomatombp.dhcp.nd.edu
uname -m = x86_64
uname -r = 13.4.0
uname -s = Darwin
uname -v = Darwin Kernel Version 13.4.0: Sun Aug 17 19:50:11 PDT 2014; root:xnu-2422.115.4~1/RELEASE_X86_64

/usr/bin/uname -p = i386
/bin/uname -X = unknown

/bin/arch = unknown
/usr/bin/arch -k = unknown
/usr/convex/getsysinfo = unknown
/usr/bin/hostinfo = Mach kernel version:
Darwin Kernel Version 13.4.0: Sun Aug 17 19:50:11 PDT 2014; root:xnu-2422.115.4~1/RELEASE_X86_64
Kernel configured for up to 4 processors.
2 processors are physically available.
4 processors are logically available.
Processor type: i486 (Intel 80486)
Processors active: 0 1 2 3
Primary memory available: 4.00 gigabytes
Default processor set: 164 tasks, 815 threads, 4 processors
Load average: 1.15, Mach factor: 2.84
/bin/machine = unknown
/usr/bin/oslevel = unknown
/bin/universe = unknown

PATH: /opt/local/bin
PATH: /opt/local/sbin
PATH: /Library/Frameworks/Python.framework/Versions/2.7/bin
PATH: /Library/Frameworks/Python.framework/Versions/Current/bin
PATH: /usr/bin
PATH: /bin
PATH: /usr/sbin
PATH: /sbin
PATH: /usr/local/bin
PATH: /opt/X11/bin


## ----------- ##
## Core tests. ##
## ----------- ##

configure:3729: checking build system type
configure:3743: result: i386-apple-darwin13.4.0
configure:3763: checking host system type
configure:3776: result: i386-apple-darwin13.4.0
configure:4157: checking for --disable-gui
configure:4187: result: no
configure:4201: checking for --enable-monolithic
configure:4231: result: no
configure:4245: checking for --enable-plugins
configure:4275: result: no
configure:4288: checking for --without-subdirs
configure:4319: result: no
configure:4339: checking for --enable-official_build
configure:4369: result: no
configure:4392: checking for --disable-all-features
configure:4422: result: no
configure:4445: checking for --enable-universal
configure:4475: result: no
configure:4600: checking for --enable-nanox
configure:4630: result: no
configure:4644: checking for --enable-gpe
configure:4674: result: no
configure:4679: checking for toolkit
configure:4746: result: osx_cocoa
configure:4769: checking for --with-libpng
configure:4797: result: yes
configure:4813: checking for --with-libjpeg
configure:4841: result: yes
configure:4857: checking for --with-libtiff
configure:4885: result: yes
configure:4910: checking for --without-libjbig
configure:4941: result: no
configure:4954: checking for --without-liblzma
configure:4985: result: no
configure:4989: checking for --with-libxpm
configure:5017: result: yes
configure:5042: checking for --with-libiconv
configure:5073: result: yes
configure:5086: checking for --with-libmspack
configure:5117: result: no
configure:5130: checking for --without-gtkprint
configure:5161: result: no
configure:5174: checking for --with-gnomevfs
configure:5205: result: no
configure:5218: checking for --with-libnotify
configure:5249: result: yes
configure:5262: checking for --with-hildon
configure:5293: result: no
configure:5306: checking for --with-opengl
configure:5337: result: auto
configure:5353: checking for --with-dmalloc
configure:5384: result: no
configure:5397: checking for --with-sdl
configure:5428: result: no
configure:5432: checking for --with-regex
configure:5460: result: yes
configure:5476: checking for --with-zlib
configure:5504: result: yes
configure:5520: checking for --with-expat
configure:5548: result: yes
configure:5564: checking for --with-macosx-sdk
configure:5575: result:
configure:5578: checking for --with-macosx-version-min
configure:5589: result:
configure:5593: checking for --enable-debug
configure:5614: result: default
configure:5647: checking for --disable-debug_flag
configure:5677: result: no
configure:5691: checking for --enable-debug_info
configure:5721: result: no
configure:5737: checking for --enable-debug_gdb
configure:5767: result: no
configure:5781: checking for --enable-debug_cntxt
configure:5811: result: no
configure:5825: checking for --enable-mem_tracing
configure:5855: result: no
configure:5871: checking for --disable-shared
configure:5901: result: no
configure:5915: checking for --enable-stl
configure:5945: result: no
configure:5964: checking for --enable-std_containers
configure:5994: result: no
configure:6008: checking for --enable-std_iostreams
configure:6038: result: yes
configure:6052: checking for --enable-std_string
configure:6082: result: yes
configure:6096: checking for --enable-std_string_conv_in_wxstring
configure:6126: result: no
configure:6140: checking for --disable-unicode
configure:6170: result: no
configure:6184: checking for --enable-mslu
configure:6214: result: no
configure:6219: checking for --enable-utf8
configure:6235: result: no
configure:6249: checking for --enable-utf8only
configure:6279: result: no
configure:6293: checking for --enable-extended_rtti
configure:6323: result: no
configure:6385: checking for --disable-optimise
configure:6415: result: no
configure:6430: checking for --enable-profile
configure:6460: result: no
configure:6474: checking for --enable-no_rtti
configure:6504: result: no
configure:6518: checking for --enable-no_exceptions
configure:6548: result: no
configure:6562: checking for --enable-permissive
configure:6592: result: no
configure:6606: checking for --enable-no_deps
configure:6636: result: no
configure:6650: checking for --disable-vararg_macros
configure:6680: result: no
configure:6686: checking for --enable-universal_binary
configure:6702: result: no
configure:6707: checking for --enable-macosx_arch
configure:6723: result: no
configure:6738: checking for --enable-compat26
configure:6768: result: no
configure:6782: checking for --disable-compat28
configure:6812: result: no
configure:6827: checking for --disable-rpath
configure:6857: result: no
configure:6872: checking for --enable-objc_uniquifying
configure:6902: result: no
configure:6917: checking for --disable-visibility
configure:6947: result: no
configure:6961: checking for --disable-tls
configure:6991: result: no
configure:7007: checking for --enable-intl
configure:7037: result: yes
configure:7051: checking for --enable-xlocale
configure:7081: result: yes
configure:7095: checking for --enable-config
configure:7125: result: yes
configure:7140: checking for --enable-protocols
configure:7170: result: yes
configure:7184: checking for --enable-ftp
configure:7214: result: yes
configure:7228: checking for --enable-http
configure:7258: result: yes
configure:7272: checking for --enable-fileproto
configure:7302: result: yes
configure:7316: checking for --enable-sockets
configure:7346: result: yes
configure:7360: checking for --enable-ipv6
configure:7390: result: no
configure:7404: checking for --enable-ole
configure:7434: result: yes
configure:7448: checking for --enable-dataobj
configure:7478: result: yes
configure:7493: checking for --enable-ipc
configure:7523: result: yes
configure:7538: checking for --enable-baseevtloop
configure:7568: result: yes
configure:7582: checking for --enable-epollloop
configure:7612: result: yes
configure:7626: checking for --enable-selectloop
configure:7656: result: yes
configure:7671: checking for --enable-any
configure:7701: result: yes
configure:7715: checking for --enable-apple_ieee
configure:7745: result: yes
configure:7759: checking for --enable-arcstream
configure:7789: result: yes
configure:7803: checking for --enable-base64
configure:7833: result: yes
configure:7847: checking for --enable-backtrace
configure:7877: result: yes
configure:7891: checking for --enable-catch_segvs
configure:7921: result: yes
configure:7935: checking for --enable-cmdline
configure:7965: result: yes
configure:7979: checking for --enable-datetime
configure:8009: result: yes
configure:8023: checking for --enable-debugreport
configure:8053: result: yes
configure:8067: checking for --enable-dialupman
configure:8097: result: yes
configure:8111: checking for --enable-dynlib
configure:8141: result: yes
configure:8155: checking for --enable-dynamicloader
configure:8185: result: yes
configure:8199: checking for --enable-exceptions
configure:8229: result: yes
configure:8243: checking for --enable-ffile
configure:8273: result: yes
configure:8287: checking for --enable-file
configure:8317: result: yes
configure:8331: checking for --enable-filehistory
configure:8361: result: yes
configure:8375: checking for --enable-filesystem
configure:8405: result: yes
configure:8419: checking for --enable-fontenum
configure:8449: result: yes
configure:8463: checking for --enable-fontmap
configure:8493: result: yes
configure:8507: checking for --enable-fs_archive
configure:8537: result: yes
configure:8551: checking for --enable-fs_inet
configure:8581: result: yes
configure:8595: checking for --enable-fs_zip
configure:8625: result: yes
configure:8639: checking for --enable-fsvolume
configure:8669: result: yes
configure:8683: checking for --enable-fswatcher
configure:8713: result: yes
configure:8727: checking for --enable-geometry
configure:8757: result: yes
configure:8771: checking for --enable-log
configure:8801: result: yes
configure:8815: checking for --enable-longlong
configure:8845: result: yes
configure:8859: checking for --enable-mimetype
configure:8889: result: yes
configure:8903: checking for --enable-printfposparam
configure:8933: result: yes
configure:8947: checking for --enable-snglinst
configure:8977: result: yes
configure:8991: checking for --enable-sound
configure:9021: result: yes
configure:9035: checking for --enable-stdpaths
configure:9065: result: yes
configure:9079: checking for --enable-stopwatch
configure:9109: result: yes
configure:9123: checking for --enable-streams
configure:9153: result: yes
configure:9167: checking for --enable-sysoptions
configure:9197: result: yes
configure:9211: checking for --enable-tarstream
configure:9241: result: yes
configure:9255: checking for --enable-textbuf
configure:9285: result: yes
configure:9299: checking for --enable-textfile
configure:9329: result: yes
configure:9343: checking for --enable-timer
configure:9373: result: yes
configure:9387: checking for --enable-variant
configure:9417: result: yes
configure:9431: checking for --enable-zipstream
configure:9461: result: yes
configure:9476: checking for --enable-url
configure:9506: result: yes
configure:9520: checking for --enable-protocol
configure:9550: result: yes
configure:9564: checking for --enable-protocol_http
configure:9594: result: yes
configure:9608: checking for --enable-protocol_ftp
configure:9638: result: yes
configure:9652: checking for --enable-protocol_file
configure:9682: result: yes
configure:9697: checking for --enable-threads
configure:9727: result: yes
configure:9742: checking for --enable-iniconf
configure:9772: result: no
configure:9786: checking for --enable-regkey
configure:9816: result: yes
configure:9834: checking for --enable-docview
configure:9864: result: yes
configure:9878: checking for --enable-help
configure:9908: result: yes
configure:9922: checking for --enable-mshtmlhelp
configure:9952: result: yes
configure:9966: checking for --enable-html
configure:9996: result: yes
configure:10010: checking for --enable-htmlhelp
configure:10040: result: yes
configure:10054: checking for --enable-xrc
configure:10084: result: yes
configure:10098: checking for --enable-aui
configure:10128: result: yes
configure:10142: checking for --enable-propgrid
configure:10172: result: yes
configure:10186: checking for --enable-ribbon
configure:10216: result: yes
configure:10230: checking for --enable-stc
configure:10260: result: yes
configure:10274: checking for --enable-constraints
configure:10304: result: yes
configure:10318: checking for --enable-loggui
configure:10348: result: yes
configure:10362: checking for --enable-logwin
configure:10392: result: yes
configure:10406: checking for --enable-logdialog
configure:10436: result: yes
configure:10450: checking for --enable-mdi
configure:10480: result: yes
configure:10494: checking for --enable-mdidoc
configure:10524: result: yes
configure:10538: checking for --enable-mediactrl
configure:10568: result: auto
configure:10582: checking for --enable-gstreamer8
configure:10612: result: no
configure:10626: checking for --enable-richtext
configure:10656: result: yes
configure:10670: checking for --enable-postscript
configure:10700: result: yes
configure:10714: checking for --enable-printarch
configure:10744: result: yes
configure:10758: checking for --enable-svg
configure:10788: result: yes
configure:10802: checking for --enable-webkit
configure:10832: result: yes
configure:10846: checking for --enable-webview
configure:10876: result: yes
configure:10939: checking for --enable-clipboard
configure:10969: result: yes
configure:10983: checking for --enable-dnd
configure:11013: result: yes
configure:11030: checking for --disable-controls
configure:11060: result: no
configure:11139: checking for --enable-markup
configure:11169: result: yes
configure:11184: checking for --enable-accel
configure:11214: result: yes
configure:11228: checking for --enable-animatectrl
configure:11258: result: yes
configure:11272: checking for --enable-bannerwindow
configure:11302: result: yes
configure:11316: checking for --enable-artstd
configure:11346: result: yes
configure:11360: checking for --enable-arttango
configure:11390: result: auto
configure:11404: checking for --enable-bmpbutton
configure:11434: result: yes
configure:11448: checking for --enable-bmpcombobox
configure:11478: result: yes
configure:11492: checking for --enable-button
configure:11522: result: yes
configure:11536: checking for --enable-calendar
configure:11566: result: yes
configure:11580: checking for --enable-caret
configure:11610: result: yes
configure:11624: checking for --enable-checkbox
configure:11654: result: yes
configure:11668: checking for --enable-checklst
configure:11698: result: yes
configure:11712: checking for --enable-choice
configure:11742: result: yes
configure:11756: checking for --enable-choicebook
configure:11786: result: yes
configure:11800: checking for --enable-collpane
configure:11830: result: yes
configure:11844: checking for --enable-colourpicker
configure:11874: result: yes
configure:11888: checking for --enable-combobox
configure:11918: result: yes
configure:11932: checking for --enable-comboctrl
configure:11962: result: yes
configure:11976: checking for --enable-commandlinkbutton
configure:12006: result: yes
configure:12020: checking for --enable-dataviewctrl
configure:12050: result: yes
configure:12064: checking for --enable-datepick
configure:12094: result: yes
configure:12108: checking for --enable-detect_sm
configure:12138: result: yes
configure:12152: checking for --enable-dirpicker
configure:12182: result: yes
configure:12196: checking for --enable-display
configure:12226: result: yes
configure:12240: checking for --enable-editablebox
configure:12270: result: yes
configure:12284: checking for --enable-filectrl
configure:12314: result: yes
configure:12328: checking for --enable-filepicker
configure:12358: result: yes
configure:12372: checking for --enable-fontpicker
configure:12402: result: yes
configure:12416: checking for --enable-gauge
configure:12446: result: yes
configure:12460: checking for --enable-grid
configure:12490: result: yes
configure:12504: checking for --enable-headerctrl
configure:12534: result: yes
configure:12548: checking for --enable-hyperlink
configure:12578: result: yes
configure:12592: checking for --enable-imaglist
configure:12622: result: yes
configure:12636: checking for --enable-infobar
configure:12666: result: yes
configure:12680: checking for --enable-listbook
configure:12710: result: yes
configure:12724: checking for --enable-listbox
configure:12754: result: yes
configure:12768: checking for --enable-listctrl
configure:12798: result: yes
configure:12812: checking for --enable-notebook
configure:12842: result: yes
configure:12856: checking for --enable-notifmsg
configure:12886: result: yes
configure:12900: checking for --enable-odcombobox
configure:12930: result: yes
configure:12944: checking for --enable-popupwin
configure:12974: result: yes
configure:12988: checking for --enable-prefseditor
configure:13018: result: yes
configure:13032: checking for --enable-radiobox
configure:13062: result: yes
configure:13076: checking for --enable-radiobtn
configure:13106: result: yes
configure:13120: checking for --enable-richmsgdlg
configure:13150: result: yes
configure:13164: checking for --enable-richtooltip
configure:13194: result: yes
configure:13208: checking for --enable-rearrangectrl
configure:13238: result: yes
configure:13252: checking for --enable-sash
configure:13282: result: yes
configure:13296: checking for --enable-scrollbar
configure:13326: result: yes
configure:13340: checking for --enable-searchctrl
configure:13370: result: yes
configure:13384: checking for --enable-slider
configure:13414: result: yes
configure:13428: checking for --enable-spinbtn
configure:13458: result: yes
configure:13472: checking for --enable-spinctrl
configure:13502: result: yes
configure:13516: checking for --enable-splitter
configure:13546: result: yes
configure:13560: checking for --enable-statbmp
configure:13590: result: yes
configure:13604: checking for --enable-statbox
configure:13634: result: yes
configure:13648: checking for --enable-statline
configure:13678: result: yes
configure:13692: checking for --enable-stattext
configure:13722: result: yes
configure:13736: checking for --enable-statusbar
configure:13766: result: yes
configure:13780: checking for --enable-taskbaricon
configure:13810: result: yes
configure:13824: checking for --enable-tbarnative
configure:13854: result: yes
configure:13868: checking for --enable-textctrl
configure:13898: result: yes
configure:13912: checking for --enable-datepick
configure:13942: result: yes
configure:13956: checking for --enable-tipwindow
configure:13986: result: yes
configure:14000: checking for --enable-togglebtn
configure:14030: result: yes
configure:14044: checking for --enable-toolbar
configure:14074: result: yes
configure:14088: checking for --enable-toolbook
configure:14118: result: yes
configure:14132: checking for --enable-treebook
configure:14162: result: yes
configure:14176: checking for --enable-treectrl
configure:14206: result: yes
configure:14220: checking for --enable-treelist
configure:14250: result: yes
configure:14266: checking for --enable-commondlg
configure:14296: result: yes
configure:14310: checking for --enable-aboutdlg
configure:14340: result: yes
configure:14354: checking for --enable-choicedlg
configure:14384: result: yes
configure:14398: checking for --enable-coldlg
configure:14428: result: yes
configure:14442: checking for --enable-filedlg
configure:14472: result: yes
configure:14486: checking for --enable-finddlg
configure:14516: result: yes
configure:14530: checking for --enable-fontdlg
configure:14560: result: yes
configure:14574: checking for --enable-dirdlg
configure:14604: result: yes
configure:14618: checking for --enable-msgdlg
configure:14648: result: yes
configure:14662: checking for --enable-numberdlg
configure:14692: result: yes
configure:14706: checking for --enable-splash
configure:14736: result: yes
configure:14750: checking for --enable-textdlg
configure:14780: result: yes
configure:14794: checking for --enable-tipdlg
configure:14824: result: yes
configure:14838: checking for --enable-progressdlg
configure:14868: result: yes
configure:14882: checking for --enable-wizarddlg
configure:14912: result: yes
configure:14928: checking for --enable-menus
configure:14958: result: yes
configure:14972: checking for --enable-miniframe
configure:15002: result: yes
configure:15016: checking for --enable-tooltips
configure:15046: result: yes
configure:15060: checking for --enable-splines
configure:15090: result: yes
configure:15104: checking for --enable-mousewheel
configure:15134: result: yes
configure:15148: checking for --enable-validators
configure:15178: result: yes
configure:15192: checking for --enable-busyinfo
configure:15222: result: yes
configure:15236: checking for --enable-hotkey
configure:15266: result: auto
configure:15280: checking for --enable-joystick
configure:15310: result: yes
configure:15324: checking for --enable-metafile
configure:15354: result: auto
configure:15368: checking for --enable-dragimage
configure:15398: result: yes
configure:15412: checking for --enable-accessibility
configure:15442: result: no
configure:15456: checking for --enable-uiactionsim
configure:15486: result: yes
configure:15500: checking for --enable-dctransform
configure:15530: result: yes
configure:15544: checking for --enable-webviewwebkit
configure:15574: result: yes
configure:15590: checking for --enable-palette
configure:15620: result: yes
configure:15634: checking for --enable-image
configure:15664: result: yes
configure:15678: checking for --enable-gif
configure:15708: result: yes
configure:15722: checking for --enable-pcx
configure:15752: result: yes
configure:15766: checking for --enable-tga
configure:15796: result: yes
configure:15810: checking for --enable-iff
configure:15840: result: yes
configure:15854: checking for --enable-pnm
configure:15884: result: yes
configure:15898: checking for --enable-xpm
configure:15928: result: yes
configure:15942: checking for --enable-ico_cur
configure:15972: result: yes
configure:15988: checking for --enable-dccache
configure:16018: result: yes
configure:16032: checking for --enable-ps-in-msw
configure:16062: result: yes
configure:16076: checking for --enable-ownerdrawn
configure:16106: result: yes
configure:16120: checking for --enable-uxtheme
configure:16150: result: yes
configure:16164: checking for --enable-wxdib
configure:16194: result: yes
configure:16208: checking for --enable-webviewie
configure:16238: result: yes
configure:16257: checking for --enable-autoidman
configure:16287: result: no
configure:16429: checking for gcc
configure:16456: result: gcc -arch i386 -mmacosx-version-min=10.7
configure:16685: checking for C compiler version
configure:16694: gcc -arch i386 -mmacosx-version-min=10.7 --version >&5
Apple LLVM version 5.1 (clang-503.0.40) (based on LLVM 3.4svn)
Target: i386-apple-darwin13.4.0
Thread model: posix
configure:16705: $? = 0
configure:16694: gcc -arch i386 -mmacosx-version-min=10.7 -v >&5
Apple LLVM version 5.1 (clang-503.0.40) (based on LLVM 3.4svn)
Target: i386-apple-darwin13.4.0
Thread model: posix
clang: warning: argument unused during compilation: '-mmacosx-version-min=10.7'
configure:16705: $? = 0
configure:16694: gcc -arch i386 -mmacosx-version-min=10.7 -V >&5
clang: error: argument to '-V' is missing (expected 1 value)
clang: error: no input files
configure:16705: $? = 1
configure:16694: gcc -arch i386 -mmacosx-version-min=10.7 -qversion >&5
clang: error: unknown argument: '-qversion' [-Wunused-command-line-argument-hard-error-in-future]
clang: note: this will be a hard error (cannot be downgraded to a warning) in the future
clang: error: no input files
configure:16705: $? = 1
configure:16725: checking whether the C compiler works
configure:16747: gcc -arch i386 -mmacosx-version-min=10.7 -O2 -arch i386 -arch i386 conftest.c >&5
configure:16751: $? = 0
configure:16799: result: yes
configure:16802: checking for C compiler default output file name
configure:16804: result: a.out
configure:16810: checking for suffix of executables
configure:16817: gcc -arch i386 -mmacosx-version-min=10.7 -o conftest -O2 -arch i386 -arch i386 conftest.c >&5
configure:16821: $? = 0
configure:16843: result:
configure:16865: checking whether we are cross compiling
configure:16873: gcc -arch i386 -mmacosx-version-min=10.7 -o conftest -O2 -arch i386 -arch i386 conftest.c >&5
configure:16877: $? = 0
configure:16884: ./conftest
configure:16888: $? = 0
configure:16903: result: no
configure:16908: checking for suffix of object files
configure:16930: gcc -arch i386 -mmacosx-version-min=10.7 -c -O2 -arch i386 conftest.c >&5
configure:16934: $? = 0
configure:16955: result: o
configure:16959: checking whether we are using the GNU C compiler
configure:16978: gcc -arch i386 -mmacosx-version-min=10.7 -c -O2 -arch i386 conftest.c >&5
configure:16978: $? = 0
configure:16987: result: yes
configure:16996: checking whether gcc -arch i386 -mmacosx-version-min=10.7 accepts -g
configure:17016: gcc -arch i386 -mmacosx-version-min=10.7 -c -g conftest.c >&5
configure:17016: $? = 0
configure:17057: result: yes
configure:17074: checking for gcc -arch i386 -mmacosx-version-min=10.7 option to accept ISO C89
configure:17137: gcc -arch i386 -mmacosx-version-min=10.7 -c -O2 -arch i386 conftest.c >&5
configure:17137: $? = 0
configure:17150: result: none needed
configure:17183: checking whether we are using the Intel C compiler
configure:17203: gcc -arch i386 -mmacosx-version-min=10.7 -c -O2 -arch i386 conftest.c >&5
conftest.c:18:17: error: use of undeclared identifier 'choke'
choke me
^
1 error generated.
configure:17203: $? = 1
configure: failed program was:
| /* confdefs.h */
| #define PACKAGE_NAME "wxWidgets"
| #define PACKAGE_TARNAME "wxwidgets"
| #define PACKAGE_VERSION "3.0.2"
| #define PACKAGE_STRING "wxWidgets 3.0.2"
| #define PACKAGE_BUGREPORT "wx-dev@lists.wxwidgets.org"
| #define PACKAGE_URL ""
| #define __BSD__ 1
| #define __DARWIN__ 1
| #define TARGET_CARBON 1
| /* end confdefs.h. */
|
| int
| main ()
| {
|
| #ifndef __INTEL_COMPILER
| choke me
| #endif
|
| ;
| return 0;
| }
configure:17213: result: no
configure:17936: checking how to run the C preprocessor
configure:17967: gcc -arch i386 -mmacosx-version-min=10.7 -E conftest.c
configure:17967: $? = 0
configure:17981: gcc -arch i386 -mmacosx-version-min=10.7 -E conftest.c
conftest.c:12:10: fatal error: 'ac_nonexistent.h' file not found
#include <ac_nonexistent.h>
^
1 error generated.
configure:17981: $? = 1
configure: failed program was:
| /* confdefs.h */
| #define PACKAGE_NAME "wxWidgets"
| #define PACKAGE_TARNAME "wxwidgets"
| #define PACKAGE_VERSION "3.0.2"
| #define PACKAGE_STRING "wxWidgets 3.0.2"
| #define PACKAGE_BUGREPORT "wx-dev@lists.wxwidgets.org"
| #define PACKAGE_URL ""
| #define __BSD__ 1
| #define __DARWIN__ 1
| #define TARGET_CARBON 1
| /* end confdefs.h. */
| #include <ac_nonexistent.h>
configure:18006: result: gcc -arch i386 -mmacosx-version-min=10.7 -E
configure:18026: gcc -arch i386 -mmacosx-version-min=10.7 -E conftest.c
configure:18026: $? = 0

User avatar
botg
Site Admin
Posts: 33176
Joined: 2004-02-23 20:49
First name: Tim
Last name: Kosse
Contact:

Re: Compile filezilla 3.9.0.6 under Mac osx

#9 Post by botg » 2014-11-11 22:54

configure:16694: gcc -arch i386 -mmacosx-version-min=10.7 --version >&5
Apple LLVM version 5.1 (clang-503.0.40) (based on LLVM 3.4svn)
That's outdated as well.

I'm running OS X 10.9 for which the compiler in the following version is already available:
Apple LLVM version 6.0 (clang-600.0.54) (based on LLVM 3.5svn)

Please update your compiler.

cs19
504 Command not implemented
Posts: 10
Joined: 2014-11-11 05:59

Re: Compile filezilla 3.9.0.6 under Mac osx

#10 Post by cs19 » 2014-11-12 01:57

I updated xcode to 6.1, but it still could not compile. :cry: Any other suggestions?

User avatar
botg
Site Admin
Posts: 33176
Joined: 2004-02-23 20:49
First name: Tim
Last name: Kosse
Contact:

Re: Compile filezilla 3.9.0.6 under Mac osx

#11 Post by botg » 2014-11-12 08:18

checking if C++ compiler (g++ -arch i386 -mmacosx-version-min=10.7 -stdlib=libc++ -mmacosx-version-min=10.5) works with SDK/version options... configure: error: in `/Users/lexy0922/Filezilla_project/wxWidgets-3.0.2/build-wx':
I wonder where the 10.5 comes from. Try passing --with-macosx-version-min=10.7 as argument to wxWidgets' configure.

cs19
504 Command not implemented
Posts: 10
Joined: 2014-11-11 05:59

Re: Compile filezilla 3.9.0.6 under Mac osx

#12 Post by cs19 » 2014-11-12 23:59

The modification worked!
However, I am now running into problem with gnutls.
The error message is
configure: error: libgnutls 3.1.12 greater was not found. You can get it from http://gnutls.org/
I installed gnutls 3.2.0. I already tried
PKG_CONFIG_PATH="$HOME/filezilla/gnutls/lib/pkgconfig:$HOME/filezilla/sqlite/lib/pkgconfig"

User avatar
botg
Site Admin
Posts: 33176
Joined: 2004-02-23 20:49
First name: Tim
Last name: Kosse
Contact:

Re: Compile filezilla 3.9.0.6 under Mac osx

#13 Post by botg » 2014-11-13 08:21

Once again, config.log please.

cs19
504 Command not implemented
Posts: 10
Joined: 2014-11-11 05:59

Re: Compile filezilla 3.9.0.6 under Mac osx

#14 Post by cs19 » 2014-11-13 14:56

It's attached.
Attachments
config.log
(131.82 KiB) Downloaded 179 times

User avatar
botg
Site Admin
Posts: 33176
Joined: 2004-02-23 20:49
First name: Tim
Last name: Kosse
Contact:

Re: Compile filezilla 3.9.0.6 under Mac osx

#15 Post by botg » 2014-11-14 08:45

Setting PKG_CONFIG_PATH is good. Better would be to also have pkg-config installed :)

Post Reply